BDBM27235 6-{[(2S,3S,4R,5R)-5-(6-amino-9H-purin-9-yl)-3,4-dihydroxyoxolan-2-yl]formamido}-N-(3-aminopropyl)hexanamide::ARC-1007, 9
SMILES NCCCNC(=O)CCCCCNC(=O)[C@H]1O[C@H]([C@H](O)[C@@H]1O)n1cnc2c(N)ncnc12
InChI Key InChIKey=JXGFPPGGBIUPLH-QCUYGVNKSA-N
Data  1 Kd
  Tab Delimited (TSV)   2D SDfile   Computed 3D by Vconf -m prep SDfile
Find this compound or compounds like it in BindingDB:
Activity Spreadsheet -- Enzyme Inhibition Constant Data from BindingDB
Found 1 hit for monomerid = 27235
TargetcAMP-dependent protein kinase catalytic subunit alpha(Mus musculus (mouse))
University of Tartu
LigandPNGBDBM27235(6-{[(2S,3S,4R,5R)-5-(6-amino-9H-purin-9-yl)-3,4-di...)
Affinity DataKd:  6.05E+3nMpH: 7.5 T: 2°C. Assay description: The assay is based on the kinase-bound labeled fluorescent probe can be displaced by competitive inhibitors, which can be registered by measurement o...
In DepthDetails ArticlePubMed